{"text_format":"1","workbook":"xlsx","n_sheets":18,"sheets":["Instructions","Factors (to hide)"," Carbon Account","Comparatives","1 Data","2 Elec Bills","3 Elec Use","4 Gas Bills","5 Gas Est","6 Public Trans","7 Car and Van","8 Road Fuel","9 Commute","10 Water bills","11 Water Est","12 Paper","13 PV Solar","Questionnaire - Carbon accounts"],"not_rendered":{"charts":0,"images":1,"macros":0,"external_links":0,"defined_names":33,"comments":0,"pivot_tables":0},"unopened":[],"bounds":{"document_bytes":16777216,"sheet_cells":100000,"rows_first":2000,"rows_last":500,"rows_between":2000,"halvings":0,"cell_chars":16384,"cell_head_chars":4096},"cells_cut":0,"cells_raw":0,"read":"whole","date_system":"1900"}

{"sheet":"Instructions","index":0,"n_rows":29,"n_cols":1,"rows_kept":29,"cut":false,"hidden":false,"merged":[]}
[]
["We have selected data is complete Y (CELL G2) at the top of the screen for each tab that we have estimated or had information about please review each tab to ensure this is correct."]
["1.    Data: In the first table please fill in the box for the percentage of renewable electricity your company uses; applicable if you bought any electricity with a Climate Change Levy Exemption Certificate, enter the percentage of your total electricity usage that the renewable electricity covers. The table below holds records of any cars or vans used by your company; these include vehicles used for commuting and vehicles used for your business. Enter a unique name for the vehicle and the engines equivalent carbon dioxide emissions in grams per kilometre, this information should be available through the vehicles manufacturer. Finally enter the percentage of waste vegetable oil used by any vehicles you have entered."]
[]
["2.    Elec Bills: This tab is for regular electricity bills. If you do not have a regular electricity bill you can simply flag the tab as complete without entering anything; you can estimate your electricity usage on the next tab. If you do have bills enter the meter reading at the beginning of your accounting period, then simply enter the dates of each bill and the meter reading on that date. If you share the electricity with other businesses, estimate the percentage used by your business and enter this in the column E. "]
[]
["3.    Elec Use: If you do not have electricity bills you can estimate what your electricity use by listing the appliances you have in the office. Also if you do have bills but have some shared usage too, enter information into this tab as well as Elec Bills. Enter the information for each appliance to calculate its electricity use over the year. The percentage share box is for instances where appliances you use are also used by another business such as lights in a shared building atrium."]
[]
["4.    Gas Bills: Similar to the electricity bills tab, this tab is for regular gas bill information. If you do not have bills to reference, you can estimate your usage in the next tab. Firstly enter the meter reading at the beginning of your accounting period, then simply enter the dates of each bill and the meter reading. If you share the gas with other businesses, estimate the percentage used by your business and enter this in the column G."]
[]
{"$rows_left_out":20}
{"sheet":"Factors (to hide)","index":1,"n_rows":82,"n_cols":14,"rows_kept":82,"cut":false,"hidden":true,"merged":[]}
["Green Accountancy Carbon Accounting for Smaller Entities"]
[]
["Factors used in the CO2 calculations"]
["Type","Factor","Units","Expiry","Document Name","Tab","Line name","Notes"]
["Electricity generated - use",0.46218999999999999,"kg CO2e/ kWh","2016-05-31","150625 DCFCarbonFactors_25_6_2015_114853","UK electricity","Electricity generated"]
["Electricity generated - WTT",6.8879999999999997E-2,"kg CO2e/ kWh","2016-05-31","150625 DCFCarbonFactors_25_6_2015_114853","WTT- UK & overseas elec","WTT- UK electricity (generation)"]
["T&D- UK electricity - use",3.8159999999999999E-2,"kg CO2e/ kWh","2016-05-31","150625 DCFCarbonFactors_25_6_2015_114853","Transmission and distribution","T&D- UK electricity"]
["T&D- UK electricity - WTT",5.6899999999999997E-3,"kg CO2e/ kWh","2016-05-31","150625 DCFCarbonFactors_25_6_2015_114853","WTT- UK & overseas elec","WTT- UK electricity (T&D)"]
["Electricity",{"$f":"SUM(B5:B8)","v":0.57491999999999988},"kg CO2e/ kWh",null,null,null,null,{"$f":"+B9*900","v":517.42799999999988}]
["Natural Gas - use",0.18445,"kg CO2e/ kWh","2016-05-31","150625 DCFCarbonFactors_25_6_2015_114853","Fuels","Natural gas"]
{"$rows_left_out":73}
{"sheet":" Carbon Account","index":2,"n_rows":25,"n_cols":2,"rows_kept":25,"cut":false,"hidden":false,"merged":[]}
[{"$f":"+'1 Data'!B8","v":"The Example Company"}]
["Carbon Accounting Statement"]
[{"$f":"\"For the period from \"&TEXT('1 Data'!B10,\"d mmmm yyyy\")&\" to \"&TEXT('1 Data'!B11,\"d mmmm yyyy\")","v":"For the period from 0 January 1900 to 0 January 1900"}]
[]
[null,"CO2e kg"]
["Electricity",{"$f":"IF(AND('2 Elec Bills'!G2=\"Yes\",'3 Elec Use'!G2=\"Yes\"),+'2 Elec Bills'!G8+'3 Elec Use'!K8,\"Data not complete\")","v":"Data not complete"}]
["Gas",{"$f":"IF(AND('4 Gas Bills'!G2=\"Yes\",'5 Gas Est'!G2=\"Yes\"),+'4 Gas Bills'!I8+'5 Gas Est'!D21, \"Data not complete\")","v":"Data not complete"}]
["Travel: Commuting (non-air)",{"$f":"(IF(AND( '9 Commute'!G2=\"Yes\"),'9 Commute'!J9, \"Data not complete\"))","v":"Data not complete"}]
["Travel: Business (non-air)",{"$f":"(IF(AND('6 Public Trans'!G2=\"Yes\",'7 Car and Van'!G2=\"Yes\",'8 Road Fuel'!G2=\"Yes\"),+'6 Public Trans'!E8+'7 Car and Van'!E8+'8 Road Fuel'!E8, \"Data not complete\"))","v":"Data not complete"}]
["Travel: Air",{"$f":"(IF(AND('6 Public Trans'!G2=\"Yes\", '9 Commute'!G2=\"Yes\"),+'6 Public Trans'!E7+'9 Commute'!J8, \"Data not complete\"))","v":"Data not complete"}]
{"$rows_left_out":16}
{"sheet":"Comparatives","index":3,"n_rows":21,"n_cols":3,"rows_kept":21,"cut":false,"hidden":false,"merged":[]}
[{"$f":"+'1 Data'!B8","v":"The Example Company"}]
["Carbon Accounting Statement"]
["These figures show the CO2e kg per £1,000 of turnover. "]
[]
[null,{"$f":"\"For the period ending \"&TEXT('1 Data'!B11,\"d mmmm yyyy\")","v":"For the period ending 0 January 1900"},"For the period ending XX MONTH 20XX"]
[null,"CO2e kg","CO2e kg"]
["Electricity",{"$f":"+' Carbon Account'!B6/' Carbon Account'!$B$22*1000","v":{"$error":"#VALUE!"}},0]
["Gas",{"$f":"+' Carbon Account'!B7/' Carbon Account'!$B$22*1000","v":{"$error":"#VALUE!"}},0]
["Travel: Commuting (non-air)",{"$f":"+' Carbon Account'!B8/' Carbon Account'!$B$22*1000","v":{"$error":"#VALUE!"}},0]
["Travel: Business (non-air)",{"$f":"+' Carbon Account'!B9/' Carbon Account'!$B$22*1000","v":{"$error":"#VALUE!"}},0]
{"$rows_left_out":12}
{"sheet":"1 Data","index":4,"n_rows":16,"n_cols":7,"rows_kept":16,"cut":false,"hidden":false,"merged":[]}
[{"$f":"+B8","v":"The Example Company"},null,null,null,null,null,"Data Complete?"]
[{"$f":"\"For the period from \"&TEXT('1 Data'!B10,\"d mmmm yyyy\")&\" to \"&TEXT('1 Data'!B11,\"d mmmm yyyy\")","v":"For the period from 0 January 1900 to 0 January 1900"},null,null,null,null,null,"Yes"]
["Data for Carbon Accounting"]
[]
["Please complete coloured cells.  White cells should not need to be amended"]
[]
[]
["Entity name:","The Example Company"]
[]
["Start"]
{"$rows_left_out":7}
{"sheet":"2 Elec Bills","index":5,"n_rows":25,"n_cols":8,"rows_kept":25,"cut":false,"hidden":false,"merged":[]}
[{"$f":"+'1 Data'!B8","v":"The Example Company"},null,null,null,null,null,"Data Complete?"]
[{"$f":"\"For the period from \"&TEXT('1 Data'!B10,\"d mmmm yyyy\")&\" to \"&TEXT('1 Data'!B11,\"d mmmm yyyy\")","v":"For the period from 0 January 1900 to 0 January 1900"},null,null,null,null,null,"No"]
["Electricity bills"]
[]
["Record here all electricity bills relating to the period.  Include date and reading at start of first bill"]
["If no bills then leave blank and complete \"Elec Use\" tab instead."]
["If you have electricity bills AND other electricity use, such as electricity in a shared space, then complete BOTH tabs."]
["Total for period",null,null,{"$f":"SUM(D11:D25)","v":0},null,{"$f":"SUM(F11:F25)","v":0},{"$f":"SUM(G11:G25)","v":0}]
["Date","Meter reading kWh","Electricity units on bill kWh","Electricity this period kWh","Percentage business","Business use in period kWh","CO2e Kg"]
[null,null,null,null,null,null,null,"< date and reading at start of first bill"]
{"$rows_left_out":16}
{"sheet":"3 Elec Use","index":6,"n_rows":30,"n_cols":11,"rows_kept":30,"cut":false,"hidden":false,"merged":[]}
[{"$f":"+'1 Data'!B8","v":"The Example Company"},null,null,null,null,null,"Data Complete?"]
[{"$f":"\"For the period from \"&TEXT('1 Data'!B10,\"d mmmm yyyy\")&\" to \"&TEXT('1 Data'!B11,\"d mmmm yyyy\")","v":"For the period from 0 January 1900 to 0 January 1900"},null,null,null,null,null,"No"]
["Electricity - use record"]
[]
["Record here any electricity use not already included in the Elec Bills tab"]
["If an item has been used for part of a year then adjust the Quantity column accordingly."]
[]
["Total for period",null,null,null,null,null,null,null,null,{"$f":"SUM(J10:J29)","v":0},{"$f":"SUM(K10:K29)","v":0}]
[null,null,"Power (kW)","Hours per day","Power used per day (kWh)","Quantity of appliances","Days per week","Weeks per year","% share ","kWh per period","CO2e KG  per period"]
["Appliance 1","Laptops",0.2,7,{"$f":"+C10*D10","v":1.4000000000000001},null,5,47,1,{"$f":"+E10*F10*G10*H10*I10","v":0},{"$f":"VLOOKUP(\"Electricity\",'Factors (to hide)'!$A:$B,2,FALSE)*J10","v":0}]
{"$rows_left_out":21}
{"sheet":"4 Gas Bills","index":7,"n_rows":25,"n_cols":10,"rows_kept":25,"cut":false,"hidden":false,"merged":[]}
[{"$f":"+'1 Data'!B8","v":"The Example Company"},null,null,null,null,null,"Data Complete?"]
[{"$f":"\"For the period from \"&TEXT('1 Data'!B10,\"d mmmm yyyy\")&\" to \"&TEXT('1 Data'!B11,\"d mmmm yyyy\")","v":"For the period from 0 January 1900 to 0 January 1900"},null,null,null,null,null,"No"]
["Gas bills"]
[]
["Record here all gas bills relating to the period.  Include date and reading at start of first bill"]
["If no bills then leave blank and complete \"Gas Est\" tab instead."]
["If you have gas bills AND other gas use, such as gas heating in a shared space, then complete BOTH tabs."]
["Total for period",null,null,null,{"$f":"SUM(E11:E25)","v":0},null,null,{"$f":"SUM(H11:H25)","v":0},{"$f":"SUM(I11:I25)","v":0}]
["Date","Meter reading","Units","Gas units on bill","Gas relating to this period","Converted to kWh","Percentage business","Business use in period kWh","CO2e Kg"]
[null,null,"kWh",null,null,null,null,null,null,"< date and reading at start of first bill"]
{"$rows_left_out":16}
{"sheet":"5 Gas Est","index":8,"n_rows":29,"n_cols":7,"rows_kept":29,"cut":false,"hidden":false,"merged":[]}
[{"$f":"+'1 Data'!B8","v":"The Example Company"},null,null,null,null,null,"Data Complete?"]
[{"$f":"\"For the period from \"&TEXT('1 Data'!B10,\"d mmmm yyyy\")&\" to \"&TEXT('1 Data'!B11,\"d mmmm yyyy\")","v":"For the period from 0 January 1900 to 0 January 1900"},null,null,null,null,null,"No"]
["Gas Estimations"]
[]
["This sheet is used to estimate gas used for heating.  This is needed if you don't have gas bills or use a shared space that is heated."]
[]
[]
["Total for period",{"$f":"MAX(B21:C21)","v":51.035543999999994},"CO2e kg"]
[null,"Area method","Power method"]
["Workspace size",70,null,"Estimate at 70 sq feet per person in absence of any information"]
{"$rows_left_out":20}
{"sheet":"6 Public Trans","index":9,"n_rows":94,"n_cols":7,"rows_kept":94,"cut":false,"hidden":false,"merged":[]}
[{"$f":"+'1 Data'!B8","v":"The Example Company"},null,null,null,null,null,"Data Complete?"]
[{"$f":"\"For the period from \"&TEXT('1 Data'!B10,\"d mmmm yyyy\")&\" to \"&TEXT('1 Data'!B11,\"d mmmm yyyy\")","v":"For the period from 0 January 1900 to 0 January 1900"},null,null,null,null,null,"No"]
["Public transport (not regular commuting)"]
[]
["Record here any public transport use that is not regular commuting"]
[]
[null,null,"Total Air Travel",null,{"$f":"+SUMIFS($E$11:$E$94,$C$11:$C$94,\"*air*\")","v":0}]
[null,null,"Total Non-Air Travel",null,{"$f":"+E9-E7","v":0}]
["Total for period",null,null,{"$f":"SUM(D11:D94)","v":0},{"$f":"SUM(E11:E94)","v":0}]
["Date","Description","Transport type","Distance (miles)","CO2e"]
{"$rows_left_out":85}
{"sheet":"7 Car and Van","index":10,"n_rows":100,"n_cols":7,"rows_kept":100,"cut":false,"hidden":false,"merged":[]}
[{"$f":"+'1 Data'!B8","v":"The Example Company"},null,null,null,null,null,"Data Complete?"]
[{"$f":"\"For the period from \"&TEXT('1 Data'!B10,\"d mmmm yyyy\")&\" to \"&TEXT('1 Data'!B11,\"d mmmm yyyy\")","v":"For the period from 0 January 1900 to 0 January 1900"},null,null,null,null,null,"No"]
["Car and Van (excluding regular commuting)"]
[]
["Each car or van used must be listed on the Data tab, otherwise an error will occur in column E"]
[]
[]
["Total for period",null,null,{"$f":"SUM(D10:D100)","v":0},{"$f":"SUM(E10:E100)","v":0}]
["Date","Description","Car or Van used","Distance (miles)","CO2e"]
[null,null,null,null,{"$f":"IFERROR(IF(AND(A10>='1 Data'!$B$10,A10<='1 Data'!$B$11),IF(C10<>\"\",VLOOKUP(C10,'1 Data'!$A$15:$C$415,2,FALSE)/1000*D10*'Factors (to hide)'!$B$60*(0.25+(1-VLOOKUP(C10,'1 Data'!$A$15:$C$35,3,FALSE))*0.75),\"\"),\"\"),0)","v":""}]
{"$rows_left_out":91}
{"sheet":"8 Road Fuel","index":11,"n_rows":100,"n_cols":7,"rows_kept":100,"cut":false,"hidden":false,"merged":[]}
[{"$f":"+'1 Data'!B8","v":"The Example Company"},null,null,null,null,null,"Data Complete?"]
[{"$f":"\"For the period from \"&TEXT('1 Data'!B10,\"d mmmm yyyy\")&\" to \"&TEXT('1 Data'!B11,\"d mmmm yyyy\")","v":"For the period from 0 January 1900 to 0 January 1900"},null,null,null,null,null,"No"]
["Road fuel purchases for business use"]
[]
[]
[]
[]
["Total for period",null,null,null,{"$f":"SUM(E10:E100)","v":0},{"$f":"SUM(F10:F100)","v":0}]
["Date","Description","Type of fuel","£","Litres","CO2e"]
[null,null,null,null,{"$f":"+IFERROR(D10/VLOOKUP(A10,'Factors (to hide)'!$A$73:$F$82,MATCH(C10,'Factors (to hide)'!$B$71:$F$71,0)+1),0)","v":0},{"$f":"+IFERROR(E10*(VLOOKUP(C10,'Factors (to hide)'!A:B,2,FALSE)),\"\")","v":""}]
{"$rows_left_out":91}
{"sheet":"9 Commute","index":12,"n_rows":31,"n_cols":10,"rows_kept":31,"cut":false,"hidden":false,"merged":[]}
[{"$f":"+'1 Data'!B8","v":"The Example Company"},null,null,null,null,null,"Data Complete?"]
[{"$f":"\"For the period from \"&TEXT('1 Data'!B10,\"d mmmm yyyy\")&\" to \"&TEXT('1 Data'!B11,\"d mmmm yyyy\")","v":"For the period from 0 January 1900 to 0 January 1900"},null,null,null,null,null,"No"]
["Commuting and other regular journeys"]
[]
["Record regular journeys of all workers at your organisation."]
["If a worker uses more than one type of transport simply complete more than one row for that worker.  "]
[]
[null,null,null,null,null,null,"Total Air Travel",null,null,{"$f":"+SUMIFS(J12:J31,G12:G31,\"*air*\")","v":0}]
[null,null,null,null,null,null,"Total Non-Air Travel",null,null,{"$f":"+J10-J8","v":0}]
["Total for period",null,null,null,null,{"$f":"SUM(F12:F31)","v":0},null,null,null,{"$f":"SUM(J12:J31)","v":0}]
{"$rows_left_out":22}
{"sheet":"10 Water bills","index":13,"n_rows":25,"n_cols":8,"rows_kept":25,"cut":false,"hidden":false,"merged":[]}
[{"$f":"+'1 Data'!B8","v":"The Example Company"},null,null,null,null,null,"Data Complete?"]
[{"$f":"\"For the period from \"&TEXT('1 Data'!B10,\"d mmmm yyyy\")&\" to \"&TEXT('1 Data'!B11,\"d mmmm yyyy\")","v":"For the period from 0 January 1900 to 0 January 1900"},null,null,null,null,null,"No"]
["Water bills"]
[]
["Record here all water bills relating to the period.  Include date and reading at start of first bill"]
["If no bills then leave blank and complete \"water Est\" tab instead."]
["If you have water bills and other water use, such as water heating in a shared space, then complete both tabs."]
["Total for period",null,null,{"$f":"SUM(D11:D25)","v":0},null,{"$f":"SUM(F11:F25)","v":0},{"$f":"SUM(G11:G25)","v":0}]
["Date","Meter reading m3","Water units on bill","Water relating to this period","Percentage business","Business use in period kWh","CO2e Kg"]
[null,null,null,null,null,null,null,"< date and reading at start of first bill"]
{"$rows_left_out":16}
{"sheet":"11 Water Est","index":14,"n_rows":21,"n_cols":7,"rows_kept":21,"cut":false,"hidden":false,"merged":[]}
[{"$f":"+'1 Data'!B8","v":"The Example Company"},null,null,null,null,null,"Data Complete?"]
[{"$f":"\"For the period from \"&TEXT('1 Data'!B10,\"d mmmm yyyy\")&\" to \"&TEXT('1 Data'!B11,\"d mmmm yyyy\")","v":"For the period from 0 January 1900 to 0 January 1900"},null,null,null,null,null,"No"]
["Water use - Estimations"]
[]
[]
[]
[]
["CO2e for period",{"$f":"+B13*VLOOKUP(\"water\",'Factors (to hide)'!$A:$B,2,FALSE)/1000","v":3.7571428571428575E-2}]
["Average number of workers",1]
["Average days per person per week",5]
{"$rows_left_out":12}
{"sheet":"12 Paper","index":15,"n_rows":100,"n_cols":7,"rows_kept":100,"cut":false,"hidden":false,"merged":[]}
[{"$f":"+'1 Data'!B8","v":"The Example Company"},null,"Note: 1 ream of paper = 500 sheets = approx 2.5kg",null,null,null,"Data Complete?"]
[{"$f":"\"For the period from \"&TEXT('1 Data'!B10,\"d mmmm yyyy\")&\" to \"&TEXT('1 Data'!B11,\"d mmmm yyyy\")","v":"For the period from 0 January 1900 to 0 January 1900"},null,null,null,null,null,"No"]
["Paper purchases (equivalent of paper use)"]
[]
[]
[]
[]
["Total for period",null,null,{"$f":"SUM(D10:D100)","v":0},{"$f":"SUM(E10:E100)","v":0}]
["Date","Description","% recycled","Weight kg","CO2e kg"]
[null,null,null,null,{"$f":"IF(AND(A10>='1 Data'!$B$10,A10<='1 Data'!$B$11),(VLOOKUP(\"paper\",'Factors (to hide)'!A:B,2,FALSE)/(2.5)*D10*(1-C10)+VLOOKUP(\"recycled paper\",'Factors (to hide)'!A:B,2,FALSE)/(2.5)*D10*(C10)),\"\")","v":0}]
{"$rows_left_out":91}
{"sheet":"13 PV Solar","index":16,"n_rows":25,"n_cols":8,"rows_kept":25,"cut":false,"hidden":false,"merged":[]}
[{"$f":"+'1 Data'!B8","v":"The Example Company"},null,null,null,null,null,"Data Complete?"]
[{"$f":"\"For the period from \"&TEXT('1 Data'!B10,\"d mmmm yyyy\")&\" to \"&TEXT('1 Data'!B11,\"d mmmm yyyy\")","v":"For the period from 0 January 1900 to 0 January 1900"},null,null,null,null,null,"No"]
["Solar Photovoltaic (PV) electricity generated"]
[]
["Record here all solar power (pv) electricity generated.  Include date and reading at start of period."]
[]
[]
["Total for period",null,null,{"$f":"SUM(D11:D25)","v":0},null,{"$f":"SUM(F11:F25)","v":0},{"$f":"SUM(G11:G25)","v":0}]
["Date","Meter reading kWh","Electricity units on bill kWh","Electricity this period kWh","Percentage business","Business use in period kWh","CO2e Kg"]
[null,null,null,null,null,null,null,"< date and reading at start of first period"]
{"$rows_left_out":16}
{"sheet":"Questionnaire - Carbon accounts","index":17,"n_rows":38,"n_cols":3,"rows_kept":38,"cut":false,"hidden":false,"merged":[]}
["Carbon Accounting - Questionnaire","Answers (complete yellow cells)"]
[]
["Data for carbon accounting"]
["How much of your energy is renewable? (%)","[type details here]"]
["What vehicles does your organisation use? Please list vehicle type (i.e. cars, vans etc.)","[type details here]"]
["What are the CO2 emissions for each vehicle? (g/km)","[type details here]"]
["Do you use waste veg oil to fuel any of the vehicles?","[type details here]"]
[]
["Electricity use"]
["Please supply details on the appliances your business currently uses, along with details on their power (kWh) and usage.","Quantity of appliances"]
{"$rows_left_out":28}